Information card for entry 7243980
Formula |
C14 H13 Cl In N O7 |
Calculated formula |
C14 H13 Cl In N O7 |
Title of publication |
Stable isomeric layered indium coordination polymers for high proton conduction |
Authors of publication |
Guo, Xiuli; Li, Zhenhua; Chen, Xiaobo; Liang, Dadong; Li, Chunguang; Li, Guanghua; Wang, Li; Shi, Zhan; Feng, Shouhua |
Journal of publication |
CrystEngComm |
Year of publication |
2022 |
Journal volume |
24 |
Journal issue |
2 |
Pages of publication |
294 - 299 |
a |
19.824 ± 0.0007 Å |
b |
13.4404 ± 0.0005 Å |
c |
13.6238 ± 0.0005 Å |
α |
90° |
β |
119.291 ± 0.001° |
γ |
90° |
Cell volume |
3165.9 ± 0.2 Å3 |
Cell temperature |
199 ± 2 K |
Ambient diffraction temperature |
199 ± 2 K |
Number of distinct elements |
6 |
Space group number |
15 |
Hermann-Mauguin space group symbol |
C 1 2/c 1 |
Hall space group symbol |
-C 2yc |
Residual factor for all reflections |
0.0208 |
Residual factor for significantly intense reflections |
0.0205 |
Weighted residual factors for significantly intense reflections |
0.0485 |
Weighted residual factors for all reflections included in the refinement |
0.0487 |
Goodness-of-fit parameter for all reflections included in the refinement |
1.09 |
Diffraction radiation wavelength |
0.71073 Å |
Diffraction radiation type |
MoKα |
Yes |
No |
No |