Information card for entry 7244092
Formula | C14 H11 N O3 |
Calculated formula | C14 H11 N O3 |
SMILES | c1ccccc1C(=O)NOC(=O)c1ccccc1 |
Title of publication | Facile synthesis of O-acylhydroxamates via reaction of oxime chlorides with carboxylic acids |
Authors of publication | Wang, Kai-Kai; Li, Yan-Li; Zhao, Ying-Chao; Zhang, Shan-Shan; Chen, Rongxiang; Sun, Aili |
Journal of publication | RSC Advances |
Year of publication | 2021 |
Journal volume | 11 |
Journal issue | 63 |
Pages of publication | 40193 - 40196 |
a | 8.9979 ± 0.0011 Å |
b | 9.4469 ± 0.0011 Å |
c | 14.0932 ± 0.0017 Å |
α | 90° |
β | 90° |
γ | 90° |
Cell volume | 1198 ± 0.2 Å3 |
Cell temperature | 296 ± 2 K |
Ambient diffraction temperature | 296 ± 2 K |
Number of distinct elements | 4 |
Space group number | 19 |
Hermann-Mauguin space group symbol | P 21 21 21 |
Hall space group symbol | P 2ac 2ab |
Residual factor for all reflections | 0.0384 |
Residual factor for significantly intense reflections | 0.0326 |
Weighted residual factors for significantly intense reflections | 0.094 |
Weighted residual factors for all reflections included in the refinement | 0.0983 |
Goodness-of-fit parameter for all reflections included in the refinement | 0.979 |
Diffraction radiation wavelength | 0.71073 Å |
Diffraction radiation type | MoKα |