Information card for entry 7244599
Chemical name | Diphenylarsinic acid |
Formula | C12 H11 As O2 |
Calculated formula | C12 H11 As O2 |
Title of publication | Self-association of diphenylpnictoginic acids in solution and solid state: covalent vs hydrogen bonding |
Authors of publication | Yakubenko, Artyom A.; Puzyk, Aleksandra M.; Korostelev, Vladislav O.; Mulloyarova, Valeriia V.; Tupikina, Elena Yu.; Tolstoy, Peter; Antonov, Alexander S. |
Journal of publication | Physical Chemistry Chemical Physics |
Year of publication | 2022 |
a | 16.0104 ± 0.0003 Å |
b | 22.3412 ± 0.0006 Å |
c | 6.1613 ± 0.0001 Å |
α | 90° |
β | 90.009 ± 0.002° |
γ | 90° |
Cell volume | 2203.84 ± 0.08 Å3 |
Cell temperature | 100 ± 2 K |
Ambient diffraction temperature | 100 ± 2 K |
Number of distinct elements | 4 |
Space group number | 14 |
Hermann-Mauguin space group symbol | P 1 21/c 1 |
Hall space group symbol | -P 2ybc |
Residual factor for all reflections | 0.0343 |
Residual factor for significantly intense reflections | 0.0308 |
Weighted residual factors for significantly intense reflections | 0.0834 |
Weighted residual factors for all reflections included in the refinement | 0.0864 |
Goodness-of-fit parameter for all reflections included in the refinement | 1.036 |
Diffraction radiation probe | x-ray |
Diffraction radiation wavelength | 1.54184 Å |
Diffraction radiation type | CuKα |