Information card for entry 7244603
Formula | C57 H57 As2 N3 O8 S3 |
Calculated formula | C57 H57 As2 N3 O8 S3 |
Title of publication | Self-association of diphenylpnictoginic acids in solution and solid state: covalent vs hydrogen bonding |
Authors of publication | Yakubenko, Artyom A.; Puzyk, Aleksandra M.; Korostelev, Vladislav O.; Mulloyarova, Valeriia V.; Tupikina, Elena Yu.; Tolstoy, Peter; Antonov, Alexander S. |
Journal of publication | Physical Chemistry Chemical Physics |
Year of publication | 2022 |
a | 18.7709 ± 0.0002 Å |
b | 18.7709 ± 0.0002 Å |
c | 26.6661 ± 0.0003 Å |
α | 90° |
β | 90° |
γ | 120° |
Cell volume | 8136.93 ± 0.15 Å3 |
Cell temperature | 100.1 ± 0.3 K |
Ambient diffraction temperature | 100.1 ± 0.3 K |
Number of distinct elements | 6 |
Space group number | 148 |
Hermann-Mauguin space group symbol | R -3 :H |
Hall space group symbol | -R 3 |
Residual factor for all reflections | 0.0593 |
Residual factor for significantly intense reflections | 0.0575 |
Weighted residual factors for significantly intense reflections | 0.1591 |
Weighted residual factors for all reflections included in the refinement | 0.1629 |
Goodness-of-fit parameter for all reflections included in the refinement | 1.083 |
Diffraction radiation probe | x-ray |
Diffraction radiation wavelength | 1.54184 Å |
Diffraction radiation type | CuKα |