Information card for entry 7245070
Formula | C19 H16 B F2 N O |
Calculated formula | C19 H16 B F2 N O |
SMILES | F[B]1(F)Oc2c(C=[N]1[C@H](c1ccccc1)C)c1ccccc1cc2 |
Title of publication | Multi-colour circularly polarized luminescence properties of chiral Schiff-base boron difluoride complexes |
Authors of publication | Ikeshita, Masahiro; Suzuki, Takato; Matsudaira, Kana; Kitahara, Maho; Imai, Yoshitane; Tsuno, Takashi |
Journal of publication | Physical Chemistry Chemical Physics |
Year of publication | 2022 |
a | 10.373 ± 0.0004 Å |
b | 13.9191 ± 0.0004 Å |
c | 11.5437 ± 0.0004 Å |
α | 90° |
β | 108.664 ± 0.004° |
γ | 90° |
Cell volume | 1579.06 ± 0.1 Å3 |
Cell temperature | 173.15 K |
Ambient diffraction temperature | 173.15 K |
Number of distinct elements | 6 |
Space group number | 4 |
Hermann-Mauguin space group symbol | P 1 21 1 |
Hall space group symbol | P 2yb |
Residual factor for all reflections | 0.0827 |
Residual factor for significantly intense reflections | 0.0472 |
Weighted residual factors for significantly intense reflections | 0.0964 |
Weighted residual factors for all reflections included in the refinement | 0.1091 |
Goodness-of-fit parameter for all reflections included in the refinement | 0.981 |
Diffraction radiation probe | x-ray |
Diffraction radiation wavelength | 0.71073 Å |
Diffraction radiation type | MoKα |