Information card for entry 7245226
Formula | C41 H30 I4 N4 O3 |
Calculated formula | C41.001 H30 I4 N4 O3.001 |
Title of publication | Structure–property investigations in urea tethered iodinated triphenylamines |
Authors of publication | Hossain, Muhammad Saddam; Ahmed, Fiaz; Karakalos, Stavros G.; Smith, Mark D.; Pant, Namrata; Garashchuk, Sophya; Greytak, Andrew B.; Docampo, Pablo; Shimizu, Linda S. |
Journal of publication | Physical Chemistry Chemical Physics |
Year of publication | 2022 |
a | 9.4847 ± 0.0012 Å |
b | 9.8569 ± 0.0013 Å |
c | 23.787 ± 0.003 Å |
α | 91.327 ± 0.003° |
β | 100.187 ± 0.003° |
γ | 114.405 ± 0.003° |
Cell volume | 1981.7 ± 0.4 Å3 |
Cell temperature | 100 ± 2 K |
Ambient diffraction temperature | 100 ± 2 K |
Number of distinct elements | 5 |
Space group number | 2 |
Hermann-Mauguin space group symbol | P -1 |
Hall space group symbol | -P 1 |
Residual factor for all reflections | 0.061 |
Residual factor for significantly intense reflections | 0.0373 |
Weighted residual factors for significantly intense reflections | 0.0721 |
Weighted residual factors for all reflections included in the refinement | 0.0818 |
Goodness-of-fit parameter for all reflections included in the refinement | 1.035 |
Diffraction radiation probe | x-ray |
Diffraction radiation wavelength | 0.71073 Å |
Diffraction radiation type | MoKα |