Information card for entry 7245969
Formula | C10 H18 N4 O6 |
Calculated formula | C10 H18 N4 O6 |
Title of publication | Synthesis, structural characterization and DFT study of N-(pyrimidyl)-ω-amino acids/peptide: β-alanine, γ-aminobutyric acid, 5-aminovaleric acid, 6-aminohexanoic acid and glycylglycine |
Authors of publication | García-Raso, Angel; Terrón, Angel; Fiol, Juan J.; López-Zafra, Adela; Picó, Gemma; Vázquez-López, Ezequiel M.; Barceló-Oliver, Miquel; Frontera, Antonio |
Journal of publication | CrystEngComm |
Year of publication | 2023 |
Journal volume | 25 |
Journal issue | 2 |
Pages of publication | 233 - 244 |
a | 9.9111 ± 0.0009 Å |
b | 10.2045 ± 0.0009 Å |
c | 15.5393 ± 0.0014 Å |
α | 81.938 ± 0.004° |
β | 74.159 ± 0.004° |
γ | 62.779 ± 0.003° |
Cell volume | 1344.3 ± 0.2 Å3 |
Cell temperature | 100 K |
Ambient diffraction temperature | 100 K |
Number of distinct elements | 4 |
Space group number | 2 |
Hermann-Mauguin space group symbol | P -1 |
Hall space group symbol | -P 1 |
Residual factor for all reflections | 0.0367 |
Residual factor for significantly intense reflections | 0.0362 |
Weighted residual factors for significantly intense reflections | 0.0996 |
Weighted residual factors for all reflections included in the refinement | 0.1001 |
Goodness-of-fit parameter for all reflections included in the refinement | 1.076 |
Diffraction radiation wavelength | 1.54178 Å |
Diffraction radiation type | CuKα |