Information card for entry 7245990
Formula | C38 H26 N4 O7 Zn |
Calculated formula | C38 H26 N4 O7 Zn |
Title of publication | Three multi-responsive luminescent Zn-CPs for the detection of antibiotics/cations/anions in aqueous media |
Authors of publication | Fan, Chuanbin; Huang, Guimei; Xing, Zhiyong; Wang, Junli; Pang, Yaqin; Huang, Qingping; Huang, Shifu; Zong, Ziao; Guo, Feng |
Journal of publication | CrystEngComm |
Year of publication | 2023 |
Journal volume | 25 |
Journal issue | 4 |
Pages of publication | 593 - 600 |
a | 15.6207 ± 0.0007 Å |
b | 11.8216 ± 0.0005 Å |
c | 17.4359 ± 0.0008 Å |
α | 90° |
β | 102.544 ± 0.002° |
γ | 90° |
Cell volume | 3142.9 ± 0.2 Å3 |
Cell temperature | 150 K |
Ambient diffraction temperature | 150 K |
Number of distinct elements | 5 |
Space group number | 14 |
Hermann-Mauguin space group symbol | P 1 21/n 1 |
Hall space group symbol | -P 2yn |
Residual factor for all reflections | 0.11 |
Residual factor for significantly intense reflections | 0.0531 |
Weighted residual factors for significantly intense reflections | 0.0856 |
Weighted residual factors for all reflections included in the refinement | 0.109 |
Goodness-of-fit parameter for all reflections included in the refinement | 1.054 |
Diffraction radiation wavelength | 0.71073 Å |
Diffraction radiation type | MoKα |