Information card for entry 7246088
Formula | C23 H20 Cd2 N8 O10 |
Calculated formula | C23 H20 Cd2 N8 O10 |
Title of publication | Solvent induced reversible single-crystal-to-single-crystal structural transformation in dynamic metal organic frameworks: a case of enhanced hydrogen sorption in polycatenated framework |
Authors of publication | Dinda, Susanta; Pahari, Goutam; Maiti, Anupam; Ghoshal, Debajyoti |
Journal of publication | CrystEngComm |
Year of publication | 2023 |
Journal volume | 25 |
Journal issue | 7 |
Pages of publication | 1116 - 1125 |
a | 10.8053 ± 0.0012 Å |
b | 15.8625 ± 0.0017 Å |
c | 16.4783 ± 0.0018 Å |
α | 90° |
β | 90.987 ± 0.003° |
γ | 90° |
Cell volume | 2823.9 ± 0.5 Å3 |
Cell temperature | 298 ± 2 K |
Ambient diffraction temperature | 298 ± 2 K |
Number of distinct elements | 5 |
Space group number | 14 |
Hermann-Mauguin space group symbol | P 1 21/c 1 |
Hall space group symbol | -P 2ybc |
Residual factor for all reflections | 0.0511 |
Residual factor for significantly intense reflections | 0.0379 |
Weighted residual factors for significantly intense reflections | 0.0888 |
Weighted residual factors for all reflections included in the refinement | 0.1013 |
Goodness-of-fit parameter for all reflections included in the refinement | 1.058 |
Diffraction radiation wavelength | 0.71073 Å |
Diffraction radiation type | MoKα |