Information card for entry 7246110
Common name | Glyphosate |
Chemical name | N-(Phosphonomethyl)glycine |
Formula | C3 H8 N O5 P |
Calculated formula | C3 H8 N O5 P |
SMILES | C(=O)(O)C[NH2+]CP(=O)(O)[O-] |
Title of publication | Discerning subtle high-pressure phase transitions in glyphosate |
Authors of publication | Wilson, Cameron J. G.; Wood, Peter A.; Parsons, Simon |
Journal of publication | CrystEngComm |
Year of publication | 2023 |
Journal volume | 25 |
Journal issue | 6 |
Pages of publication | 988 - 997 |
a | 8.672 ± 0.0006 Å |
b | 7.9508 ± 0.0003 Å |
c | 9.8213 ± 0.0003 Å |
α | 90° |
β | 106.235 ± 0.004° |
γ | 90° |
Cell volume | 650.17 ± 0.06 Å3 |
Cell temperature | 293.15 K |
Ambient diffraction temperature | 293.15 K |
Number of distinct elements | 5 |
Space group number | 14 |
Hermann-Mauguin space group symbol | P 1 21/c 1 |
Hall space group symbol | -P 2ybc |
Residual factor for all reflections | 0.033 |
Residual factor for significantly intense reflections | 0.0253 |
Weighted residual factors for significantly intense reflections | 0.0612 |
Weighted residual factors for all reflections included in the refinement | 0.0642 |
Goodness-of-fit parameter for all reflections included in the refinement | 1.071 |
Diffraction radiation wavelength | 0.56086 Å |
Diffraction radiation type | AgKα |