Information card for entry 7246117
Common name | Glyphosate |
Chemical name | N-(Phosphonomethyl)glycine |
Formula | C3 H8 N O5 P |
Calculated formula | C3 H8 N O5 P |
SMILES | C(=O)(O)C[NH2+]CP(=O)(O)[O-] |
Title of publication | Discerning subtle high-pressure phase transitions in glyphosate |
Authors of publication | Wilson, Cameron J. G.; Wood, Peter A.; Parsons, Simon |
Journal of publication | CrystEngComm |
Year of publication | 2023 |
Journal volume | 25 |
Journal issue | 6 |
Pages of publication | 988 - 997 |
a | 8.6334 ± 0.0014 Å |
b | 7.7827 ± 0.0007 Å |
c | 9.5468 ± 0.0009 Å |
α | 90° |
β | 108.729 ± 0.01° |
γ | 90° |
Cell volume | 607.49 ± 0.13 Å3 |
Cell temperature | 293.15 K |
Ambient diffraction temperature | 293.15 K |
Number of distinct elements | 5 |
Space group number | 14 |
Hermann-Mauguin space group symbol | P 1 21/c 1 |
Hall space group symbol | -P 2ybc |
Residual factor for all reflections | 0.047 |
Residual factor for significantly intense reflections | 0.0298 |
Weighted residual factors for significantly intense reflections | 0.0662 |
Weighted residual factors for all reflections included in the refinement | 0.072 |
Goodness-of-fit parameter for all reflections included in the refinement | 1.067 |
Diffraction radiation wavelength | 0.56086 Å |
Diffraction radiation type | AgKα |