Information card for entry 7246136
Formula | C57 H54 F17 N4 O8 Sm |
Calculated formula | C57 H54 F17 N4 O8 Sm |
Title of publication | Reversible trans-to-cis photoisomerization and irreversible photocyclization reactions of a Co-coordinated stilbene derivative on chiral di-β-diketonate lanthanide complexes |
Authors of publication | Hou, Ziting; Huang, Yanji; Ruan, Yushan; Xu, Han; Tan, Yu; Lin, Li-Rong; Wu, Zhen-yi |
Journal of publication | RSC Advances |
Year of publication | 2023 |
Journal volume | 13 |
Journal issue | 4 |
Pages of publication | 2269 - 2282 |
a | 29.487 ± 0.0004 Å |
b | 20.0974 ± 0.0003 Å |
c | 20.6981 ± 0.0003 Å |
α | 90° |
β | 108.271 ± 0.001° |
γ | 90° |
Cell volume | 11647.5 ± 0.3 Å3 |
Cell temperature | 100 ± 1 K |
Ambient diffraction temperature | 100 ± 1 K |
Number of distinct elements | 6 |
Space group number | 5 |
Hermann-Mauguin space group symbol | C 1 2 1 |
Hall space group symbol | C 2y |
Residual factor for all reflections | 0.0601 |
Residual factor for significantly intense reflections | 0.0514 |
Weighted residual factors for significantly intense reflections | 0.1376 |
Weighted residual factors for all reflections included in the refinement | 0.1441 |
Goodness-of-fit parameter for all reflections included in the refinement | 1.083 |
Diffraction radiation probe | x-ray |
Diffraction radiation wavelength | 1.54184 Å |
Diffraction radiation type | CuKα |