Information card for entry 7246180
Formula | C52 H51 Co2 N16 O54 P W12 |
Calculated formula | C52 H50 Co2 N16 O54 P W12 |
Title of publication | Five new multifunctional inorganic–organic hybrids based on Keggin-type polyoxometalates and a 3,5-di(1H-imidazol-1-yl)benzoic acid ligand |
Authors of publication | Yu, Xiao-Yang; Lv, Yanxin; Weng, Xiaoyu; Geng, Jiaqi; Yang, Yanyan; Jin, Hua; Cui, Hao; Fu, Bo; Qu, Xiaoshu; Shi, Hongfei; Cao, Xueling |
Journal of publication | CrystEngComm |
Year of publication | 2023 |
Journal volume | 25 |
Journal issue | 15 |
Pages of publication | 2185 - 2195 |
a | 12.3693 ± 0.0007 Å |
b | 13.7755 ± 0.0008 Å |
c | 13.7884 ± 0.0008 Å |
α | 66.873 ± 0.002° |
β | 73.72 ± 0.002° |
γ | 84.454 ± 0.002° |
Cell volume | 2073.8 ± 0.2 Å3 |
Cell temperature | 279 ± 2 K |
Ambient diffraction temperature | 279 K |
Number of distinct elements | 7 |
Space group number | 2 |
Hermann-Mauguin space group symbol | P -1 |
Hall space group symbol | -P 1 |
Residual factor for all reflections | 0.0636 |
Residual factor for significantly intense reflections | 0.057 |
Weighted residual factors for significantly intense reflections | 0.1542 |
Weighted residual factors for all reflections included in the refinement | 0.1596 |
Goodness-of-fit parameter for all reflections included in the refinement | 1.07 |
Diffraction radiation wavelength | 0.71076 Å |
Diffraction radiation type | MoKα |