Information card for entry 7246225
Formula | C16 H24 Cd Cl4 N2 |
Calculated formula | C16 H24 Cd Cl4 N2 |
Title of publication | Two-dimensional organic–inorganic hybrid perovskite ferroelastics: (PEA)2[CdCl4], (3-FPEA)2[CdCl4], and (4-FPEA)2[CdCl4] |
Authors of publication | Yue, Zhi-Yuan; Luo, Wang; Wang, Na; Li, Hua-Kai; Xu, Ze-Jiang; Feng, Yan; Shi, Chao; Ye, Heng-Yun; Miao, Le-Ping |
Journal of publication | CrystEngComm |
Year of publication | 2023 |
Journal volume | 25 |
Journal issue | 8 |
Pages of publication | 1270 - 1275 |
a | 7.3756 ± 0.0005 Å |
b | 7.4398 ± 0.0005 Å |
c | 38.942 ± 0.002 Å |
α | 90° |
β | 90° |
γ | 90° |
Cell volume | 2136.9 ± 0.2 Å3 |
Cell temperature | 293.01 ± 0.1 K |
Ambient diffraction temperature | 293.01 ± 0.1 K |
Number of distinct elements | 5 |
Space group number | 61 |
Hermann-Mauguin space group symbol | P b c a |
Hall space group symbol | -P 2ac 2ab |
Residual factor for all reflections | 0.075 |
Residual factor for significantly intense reflections | 0.0543 |
Weighted residual factors for significantly intense reflections | 0.1294 |
Weighted residual factors for all reflections included in the refinement | 0.1406 |
Goodness-of-fit parameter for all reflections included in the refinement | 1.108 |
Diffraction radiation probe | x-ray |
Diffraction radiation wavelength | 0.71073 Å |
Diffraction radiation type | MoKα |