Information card for entry 7246291
Formula | C61 H77 Cl4 N5 O13 |
Calculated formula | C61 H53 Cl4 N5 O13 |
Title of publication | Host–guest binding of tetracationic cyclophanes to photodynamic agents inhibits posttreatment phototoxicity and maintains antitumour efficacy |
Authors of publication | Sun, Jian-Da; Liu, Yamin; Zhao, Zijian; Yu, Shang-Bo; Qi, Qiao-Yan; Zhou, Wei; Wang, Hui; Hu, Ke; Zhang, Dan-Wei; Li, Zhan-Ting |
Journal of publication | RSC Medicinal Chemistry |
Year of publication | 2023 |
a | 10.8172 ± 0.0005 Å |
b | 17.964 ± 0.0007 Å |
c | 18.8642 ± 0.0008 Å |
α | 69.309 ± 0.002° |
β | 85.526 ± 0.002° |
γ | 72.745 ± 0.002° |
Cell volume | 3273.4 ± 0.2 Å3 |
Cell temperature | 173 ± 2 K |
Ambient diffraction temperature | 173 K |
Number of distinct elements | 5 |
Space group number | 2 |
Hermann-Mauguin space group symbol | P -1 |
Hall space group symbol | -P 1 |
Residual factor for all reflections | 0.1242 |
Residual factor for significantly intense reflections | 0.1083 |
Weighted residual factors for significantly intense reflections | 0.3465 |
Weighted residual factors for all reflections included in the refinement | 0.3685 |
Goodness-of-fit parameter for all reflections included in the refinement | 1.572 |
Diffraction radiation wavelength | 1.34138 Å |
Diffraction radiation type | GaKα |