Information card for entry 7246305
Formula | C15 H17 I2 N O |
Calculated formula | C15 H17 I2 N O |
Title of publication | Halogen-bonded liquid-crystalline complexes formed from 4-alkoxyphenylpyridines with iodine and with interhalogens |
Authors of publication | McAllister, Linda J.; Taylor, James; Pridmore, Natalie E.; McEllin, Alice J.; Whitwood, Adrian C.; Karadakov, Peter B.; Bruce, Duncan W. |
Journal of publication | CrystEngComm |
Year of publication | 2023 |
Journal volume | 25 |
Journal issue | 11 |
Pages of publication | 1683 - 1692 |
a | 8.7375 ± 0.0003 Å |
b | 9.2799 ± 0.0004 Å |
c | 10.6024 ± 0.0007 Å |
α | 106.226 ± 0.005° |
β | 98.182 ± 0.004° |
γ | 100.729 ± 0.004° |
Cell volume | 793.61 ± 0.07 Å3 |
Cell temperature | 110.05 ± 0.1 K |
Ambient diffraction temperature | 110.05 ± 0.1 K |
Number of distinct elements | 5 |
Space group number | 2 |
Hermann-Mauguin space group symbol | P -1 |
Hall space group symbol | -P 1 |
Residual factor for all reflections | 0.0355 |
Residual factor for significantly intense reflections | 0.0242 |
Weighted residual factors for significantly intense reflections | 0.0429 |
Weighted residual factors for all reflections included in the refinement | 0.0489 |
Goodness-of-fit parameter for all reflections included in the refinement | 1.087 |
Diffraction radiation probe | x-ray |
Diffraction radiation wavelength | 0.71071 Å |
Diffraction radiation type | MoKα |