Information card for entry 7246334
Formula | C84 H126 N2 O36 Ti10 |
Calculated formula | C84 H126 N2 O36 Ti10 |
Title of publication | Substituted benzoate-anchored decanuclear titanium-oxo clusters featuring an unprecedented defective double-cubane geometry |
Authors of publication | Pei, Xin-Yue; He, Ying; Wang, Jia-Yin; Wang, Hong-Yan; Bo, Qi-Bing |
Journal of publication | CrystEngComm |
Year of publication | 2023 |
Journal volume | 25 |
Journal issue | 11 |
Pages of publication | 1617 - 1625 |
a | 15.2841 ± 0.0007 Å |
b | 15.8379 ± 0.0005 Å |
c | 16.1254 ± 0.0006 Å |
α | 119.36 ± 0.004° |
β | 99.503 ± 0.004° |
γ | 106.205 ± 0.004° |
Cell volume | 3046.9 ± 0.3 Å3 |
Cell temperature | 293 ± 2 K |
Ambient diffraction temperature | 293 ± 2 K |
Number of distinct elements | 5 |
Space group number | 2 |
Hermann-Mauguin space group symbol | P -1 |
Hall space group symbol | -P 1 |
Residual factor for all reflections | 0.0879 |
Residual factor for significantly intense reflections | 0.0566 |
Weighted residual factors for significantly intense reflections | 0.166 |
Weighted residual factors for all reflections included in the refinement | 0.1826 |
Goodness-of-fit parameter for all reflections included in the refinement | 1.055 |
Diffraction radiation probe | x-ray |
Diffraction radiation wavelength | 0.71073 Å |
Diffraction radiation type | MoKα |