Information card for entry 7246350
Formula | C9 H8 Br3 N O Pb |
Calculated formula | C9 H8 Br3 N O Pb |
Title of publication | On structural factors determining the nature of the fluorescent properties of OIHMs based on 8-hydroxyquinoline |
Authors of publication | Bogdan, Marta; Sierański, Tomasz; Świątkowski, Marcin; Trzęsowska-Kruszyńska, Agata |
Journal of publication | CrystEngComm |
Year of publication | 2023 |
Journal volume | 25 |
Journal issue | 13 |
Pages of publication | 1993 - 2002 |
a | 4.0631 ± 0.0001 Å |
b | 21.2351 ± 0.0007 Å |
c | 14.5111 ± 0.0005 Å |
α | 90° |
β | 97.763 ± 0.004° |
γ | 90° |
Cell volume | 1240.55 ± 0.07 Å3 |
Cell temperature | 100 ± 0.1 K |
Ambient diffraction temperature | 100 ± 0.1 K |
Number of distinct elements | 6 |
Space group number | 14 |
Hermann-Mauguin space group symbol | P 1 21/n 1 |
Hall space group symbol | -P 2yn |
Residual factor for all reflections | 0.0135 |
Residual factor for significantly intense reflections | 0.0118 |
Weighted residual factors for significantly intense reflections | 0.0273 |
Weighted residual factors for all reflections included in the refinement | 0.0277 |
Goodness-of-fit parameter for all reflections included in the refinement | 1.038 |
Diffraction radiation probe | x-ray |
Diffraction radiation wavelength | 0.71073 Å |
Diffraction radiation type | MoKα |