Information card for entry 7246367
Chemical name | trans-dimethyl 9,10-dihydro-9,10- ethanoanthracene-11,12-dicarboxylate |
Formula | C46 H43 N O8 |
Calculated formula | C46 H43 N O8 |
Title of publication | Complementary host behaviour of three anthracenyl-derived roof-shaped compounds in mixed pyridines |
Authors of publication | Barton, Benita; Caira, Mino R.; Senekal, Ulrich; Hosten, Eric C. |
Journal of publication | CrystEngComm |
Year of publication | 2023 |
Journal volume | 25 |
Journal issue | 12 |
Pages of publication | 1740 - 1754 |
a | 21.396 ± 0.0012 Å |
b | 15.5788 ± 0.0009 Å |
c | 11.3832 ± 0.0006 Å |
α | 90° |
β | 90° |
γ | 90° |
Cell volume | 3794.3 ± 0.4 Å3 |
Cell temperature | 200 ± 2 K |
Ambient diffraction temperature | 200 ± 2 K |
Number of distinct elements | 4 |
Space group number | 60 |
Hermann-Mauguin space group symbol | P b c n |
Hall space group symbol | -P 2n 2ab |
Residual factor for all reflections | 0.0841 |
Residual factor for significantly intense reflections | 0.0695 |
Weighted residual factors for significantly intense reflections | 0.209 |
Weighted residual factors for all reflections included in the refinement | 0.229 |
Goodness-of-fit parameter for all reflections included in the refinement | 1.044 |
Diffraction radiation wavelength | 0.71073 Å |
Diffraction radiation type | MoKα |