Information card for entry 7246370
Chemical name | trans-α,α,α',α'-tetraphenyl-9,10-dihydro-9,10-ethanoanthracene-11,12-dimethanol |
Formula | C48 H41 N O2 |
Calculated formula | C48 H41 N O2 |
Title of publication | Complementary host behaviour of three anthracenyl-derived roof-shaped compounds in mixed pyridines |
Authors of publication | Barton, Benita; Caira, Mino R.; Senekal, Ulrich; Hosten, Eric C. |
Journal of publication | CrystEngComm |
Year of publication | 2023 |
Journal volume | 25 |
Journal issue | 12 |
Pages of publication | 1740 - 1754 |
a | 18.95 ± 0.004 Å |
b | 8.983 ± 0.002 Å |
c | 22.253 ± 0.005 Å |
α | 90° |
β | 107.012 ± 0.009° |
γ | 90° |
Cell volume | 3622.3 ± 1.4 Å3 |
Cell temperature | 296 ± 2 K |
Ambient diffraction temperature | 296 ± 2 K |
Number of distinct elements | 4 |
Space group number | 14 |
Hermann-Mauguin space group symbol | P 1 21/c 1 |
Hall space group symbol | -P 2ybc |
Residual factor for all reflections | 0.0651 |
Residual factor for significantly intense reflections | 0.0463 |
Weighted residual factors for significantly intense reflections | 0.1159 |
Weighted residual factors for all reflections included in the refinement | 0.1321 |
Goodness-of-fit parameter for all reflections included in the refinement | 1.035 |
Diffraction radiation wavelength | 0.71073 Å |
Diffraction radiation type | MoKα |