Information card for entry 7246380
Formula | C65.5 H46.5 N5.5 O15.5 Zn3 |
Calculated formula | C65.5 H46.5 N5.5 O15.5 Zn3 |
Title of publication | Luminescence properties of mixed-ligand MOFs containing fluorene scaffolds functionalized with isonicotinoyl arms |
Authors of publication | Delledonne, Andrea; Orlandini, Martina; Terenziani, Francesca; Mazzeo, Paolo Pio; Bacchi, Alessia; Carlucci, Lucia; Comotti, Angiolina; Perego, Jacopo; Pelagatti, Paolo |
Journal of publication | CrystEngComm |
Year of publication | 2023 |
Journal volume | 25 |
Journal issue | 14 |
Pages of publication | 2085 - 2095 |
a | 32.28 ± 0.06 Å |
b | 17.76 ± 0.03 Å |
c | 19.21 ± 0.03 Å |
α | 90° |
β | 104.08 ± 0.05° |
γ | 90° |
Cell volume | 10682 ± 3 Å3 |
Cell temperature | 100 ± 2 K |
Ambient diffraction temperature | 100 ± 2 K |
Number of distinct elements | 5 |
Space group number | 14 |
Hermann-Mauguin space group symbol | P 1 21/c 1 |
Hall space group symbol | -P 2ybc |
Residual factor for all reflections | 0.1675 |
Residual factor for significantly intense reflections | 0.1013 |
Weighted residual factors for significantly intense reflections | 0.2967 |
Weighted residual factors for all reflections included in the refinement | 0.3684 |
Goodness-of-fit parameter for all reflections included in the refinement | 1.025 |
Diffraction radiation wavelength | 0.7 Å |
Diffraction radiation type | synchrotron |