Information card for entry 7246382
Common name | 2DMT/m-cresol |
Chemical name | (R,R)-(-)-2,3-dimethoxy-1,1,4,4-tetraphenylbutane-1,4-diol |
Formula | C67 H68 O9 |
Calculated formula | C67 H68 O9 |
Title of publication | An investigation of the selectivity behaviour of host compound (R,R)-(−)-2,3-dimethoxy-1,1,4,4-tetraphenylbutane-1,4-diol in mixed cresols |
Authors of publication | Barton, Benita; Pohl, Pieter L.; Hosten, Eric C. |
Journal of publication | CrystEngComm |
Year of publication | 2023 |
Journal volume | 25 |
Journal issue | 12 |
Pages of publication | 1731 - 1739 |
a | 17.3219 ± 0.0009 Å |
b | 12.0646 ± 0.0006 Å |
c | 14.1378 ± 0.0007 Å |
α | 90° |
β | 110.136 ± 0.002° |
γ | 90° |
Cell volume | 2774 ± 0.2 Å3 |
Cell temperature | 200 ± 2 K |
Ambient diffraction temperature | 200 ± 2 K |
Number of distinct elements | 3 |
Space group number | 5 |
Hermann-Mauguin space group symbol | C 1 2 1 |
Hall space group symbol | C 2y |
Residual factor for all reflections | 0.0418 |
Residual factor for significantly intense reflections | 0.0349 |
Weighted residual factors for significantly intense reflections | 0.0886 |
Weighted residual factors for all reflections included in the refinement | 0.0931 |
Goodness-of-fit parameter for all reflections included in the refinement | 1.03 |
Diffraction radiation wavelength | 0.71073 Å |
Diffraction radiation type | MoKα |