Information card for entry 7246401
Formula | C14 H22 Cl4 Cu2 N8 O19 S2 |
Calculated formula | C14 H22 Cl4 Cu2 N8 O19 S2 |
Title of publication | Perchlorate-induced structural diversity in thiosemicarbazone copper(ii) complexes provides insights to understand the reactivity in acidic and basic media |
Authors of publication | Gil-García, Rubén; Madariaga, Gotzon; Jiménez-Pérez, Alondra; Herrán-Torres, Ignacio; Gago-González, Adrián; Ugalde, María; Januskaitis, Vaidas; Barrera-García, Joaquín; Insausti, Maite; S. Galletero, María; Borrás, Joaquín; Cuevas, José Vicente; Pedrido, Rosa; Gómez-Saiz, Patricia; Lezama, Luis; García-Tojal, Javier |
Journal of publication | CrystEngComm |
Year of publication | 2023 |
Journal volume | 25 |
Journal issue | 15 |
Pages of publication | 2213 - 2226 |
a | 14.429 ± 0.006 Å |
b | 18.17 ± 0.013 Å |
c | 13.688 ± 0.005 Å |
α | 90° |
β | 118.29 ± 0.04° |
γ | 90° |
Cell volume | 3160 ± 3 Å3 |
Cell temperature | 293 ± 2 K |
Ambient diffraction temperature | 293 ± 2 K |
Number of distinct elements | 7 |
Space group number | 15 |
Hermann-Mauguin space group symbol | C 1 2/c 1 |
Hall space group symbol | -C 2yc |
Residual factor for all reflections | 0.1104 |
Residual factor for significantly intense reflections | 0.0453 |
Weighted residual factors for all reflections included in the refinement | 0.1032 |
Goodness-of-fit parameter for all reflections included in the refinement | 0.832 |
Diffraction radiation wavelength | 0.71069 Å |
Diffraction radiation type | MoKα |