Information card for entry 7246406
Formula | C32 H30 B Br |
Calculated formula | C32 H30 B Br |
Title of publication | Structural and mechanistic studies of excitation- and temperature-tunable multicolor luminescence of triarylborane |
Authors of publication | Xie, Yangbin; Dai, Songshan; Wang, Yue; Wang, Xi; Sun, Ying; Ju, Zhenghua; Fang, Ran; Zhang, Baoxin; Wu, Jincai; Zhang, Xiaoxiang; Pan, Xiaobo |
Journal of publication | CrystEngComm |
Year of publication | 2023 |
Journal volume | 25 |
Journal issue | 15 |
Pages of publication | 2204 - 2212 |
a | 9.3292 ± 0.0005 Å |
b | 12.1601 ± 0.0004 Å |
c | 12.7627 ± 0.0005 Å |
α | 71.759 ± 0.003° |
β | 81.597 ± 0.004° |
γ | 81.225 ± 0.004° |
Cell volume | 1351.51 ± 0.1 Å3 |
Cell temperature | 298.78 ± 0.1 K |
Ambient diffraction temperature | 298.78 ± 0.1 K |
Number of distinct elements | 4 |
Space group number | 2 |
Hermann-Mauguin space group symbol | P -1 |
Hall space group symbol | -P 1 |
Residual factor for all reflections | 0.0514 |
Residual factor for significantly intense reflections | 0.0445 |
Weighted residual factors for significantly intense reflections | 0.1197 |
Weighted residual factors for all reflections included in the refinement | 0.1246 |
Goodness-of-fit parameter for all reflections included in the refinement | 1.023 |
Diffraction radiation probe | x-ray |
Diffraction radiation wavelength | 1.54184 Å |
Diffraction radiation type | CuKα |