Information card for entry 7246445
Formula | C79 H77 N3 O22 Zn |
Calculated formula | C79 H77 N3 O22 Zn |
Title of publication | Three new coordination geometries of homoleptic Zn complexes of curcuminoids and their high antiproliferative potential |
Authors of publication | Meza-Morales, William; Alvarez-Ricardo, Yair; Obregón-Mendoza, Marco A.; Arenaza-Corona, Antonino; Ramírez-Apan, María Teresa; Toscano, Rubén A.; Poveda-Jaramillo, Juan Carlos; Enríquez, Raúl G. |
Journal of publication | RSC Advances |
Year of publication | 2023 |
Journal volume | 13 |
Journal issue | 13 |
Pages of publication | 8577 - 8585 |
a | 10.5643 ± 0.0005 Å |
b | 12.4244 ± 0.0005 Å |
c | 30.5143 ± 0.0014 Å |
α | 91.7948 ± 0.001° |
β | 92.0579 ± 0.001° |
γ | 114.781 ± 0.0009° |
Cell volume | 3629.3 ± 0.3 Å3 |
Cell temperature | 100 ± 2 K |
Ambient diffraction temperature | 100 ± 2 K |
Number of distinct elements | 5 |
Space group number | 2 |
Hermann-Mauguin space group symbol | P -1 |
Hall space group symbol | -P 1 |
Residual factor for all reflections | 0.0614 |
Residual factor for significantly intense reflections | 0.047 |
Weighted residual factors for significantly intense reflections | 0.1096 |
Weighted residual factors for all reflections included in the refinement | 0.1176 |
Goodness-of-fit parameter for all reflections included in the refinement | 1.051 |
Diffraction radiation wavelength | 0.71073 Å |
Diffraction radiation type | MoKα |