Information card for entry 7246448
Formula | C27 H18 N6 O6 Se3 |
Calculated formula | C27 H18 N6 O6 Se3 |
Title of publication | On the inverse correlation between the hydrogen bond strength and chalcogen bond strength in the cyclic supramolecular heterosynthon [–Se–N]⋯[HOOC–] |
Authors of publication | Lan, Honghong; Miao, Shaobin; Zhang, Yu; Wang, Weizhou |
Journal of publication | CrystEngComm |
Year of publication | 2023 |
Journal volume | 25 |
Journal issue | 14 |
Pages of publication | 2159 - 2164 |
a | 3.9284 ± 0.0002 Å |
b | 26.3154 ± 0.0012 Å |
c | 13.1324 ± 0.0006 Å |
α | 90° |
β | 91.977 ± 0.004° |
γ | 90° |
Cell volume | 1356.79 ± 0.11 Å3 |
Cell temperature | 291 K |
Ambient diffraction temperature | 291 K |
Number of distinct elements | 5 |
Space group number | 4 |
Hermann-Mauguin space group symbol | P 1 21 1 |
Hall space group symbol | P 2yb |
Residual factor for all reflections | 0.0936 |
Residual factor for significantly intense reflections | 0.066 |
Weighted residual factors for significantly intense reflections | 0.102 |
Weighted residual factors for all reflections included in the refinement | 0.1107 |
Goodness-of-fit parameter for all reflections included in the refinement | 1.059 |
Diffraction radiation probe | x-ray |
Diffraction radiation wavelength | 0.71073 Å |
Diffraction radiation type | MoKα |