Information card for entry 7246476
Formula | C18 H20 Cu N2 O4 |
Calculated formula | C18 H20 Cu N2 O4 |
Title of publication | Copper(ii) and cobalt(iii) Schiff base complexes with hydroxy anchors as sensitizers in dye-sensitized solar cells (DSSCs) |
Authors of publication | Gautam, Chiteri; Srivastava, Devyani; Kociok-Köhn, Gabriele; Gosavi, Suresh W.; Sharma, Vinod K.; Chauhan, Ratna; Late, Dattatray J.; Kumar, Abhinav; Muddassir, Mohd. |
Journal of publication | RSC Advances |
Year of publication | 2023 |
Journal volume | 13 |
Journal issue | 13 |
Pages of publication | 9046 - 9054 |
a | 18.2551 ± 0.0009 Å |
b | 4.7699 ± 0.0002 Å |
c | 19.5922 ± 0.0009 Å |
α | 90° |
β | 98.785 ± 0.005° |
γ | 90° |
Cell volume | 1685.98 ± 0.14 Å3 |
Cell temperature | 150 ± 2 K |
Ambient diffraction temperature | 149.9 ± 0.5 K |
Number of distinct elements | 5 |
Space group number | 14 |
Hermann-Mauguin space group symbol | P 1 21/c 1 |
Hall space group symbol | -P 2ybc |
Residual factor for all reflections | 0.048 |
Residual factor for significantly intense reflections | 0.033 |
Weighted residual factors for significantly intense reflections | 0.0752 |
Weighted residual factors for all reflections included in the refinement | 0.0826 |
Goodness-of-fit parameter for all reflections included in the refinement | 1.024 |
Diffraction radiation probe | x-ray |
Diffraction radiation wavelength | 0.71073 Å |
Diffraction radiation type | MoKα |