Information card for entry 7246478
Formula | C10 H6 Br2 Cl2 Cu I2 N2 |
Calculated formula | C10 H6 Br2 Cl2 Cu I2 N2 |
Title of publication | Halogen bond and polymorphism in trans-bis(2-iodo-5-halopyridine)dihalocopper(ii) complexes: crystallographic, theoretical and magnetic studies |
Authors of publication | Awwadi, Firas F.; Alwahsh, Manal I.; Turnbull, Mark M.; Landee, Christopher P. |
Journal of publication | CrystEngComm |
Year of publication | 2023 |
Journal volume | 25 |
Journal issue | 16 |
Pages of publication | 2390 - 2403 |
a | 8.4631 ± 0.0004 Å |
b | 13.1568 ± 0.0006 Å |
c | 14.6722 ± 0.0005 Å |
α | 90° |
β | 91.403 ± 0.004° |
γ | 90° |
Cell volume | 1633.22 ± 0.12 Å3 |
Cell temperature | 293 ± 2 K |
Ambient diffraction temperature | 293 ± 2 K |
Number of distinct elements | 7 |
Space group number | 15 |
Hermann-Mauguin space group symbol | C 1 2/c 1 |
Hall space group symbol | -C 2yc |
Residual factor for all reflections | 0.0454 |
Residual factor for significantly intense reflections | 0.0324 |
Weighted residual factors for significantly intense reflections | 0.0576 |
Weighted residual factors for all reflections included in the refinement | 0.0639 |
Goodness-of-fit parameter for all reflections included in the refinement | 1.013 |
Diffraction radiation wavelength | 0.71073 Å |
Diffraction radiation type | MoKα |