Information card for entry 7246489
Chemical name | 4-(4-methoxyphenyl)-7-[1-(4-methoxyphenyl)-1H-phenanthro[9,10-d]imidazol-2-yl]benzo[c][1,2,5]thiadiazole |
Formula | C35 H24 N4 O2 S |
Calculated formula | C35 H24 N4 O2 S |
SMILES | s1nc2c(c3n(c4c5ccccc5c5ccccc5c4n3)c3ccc(OC)cc3)ccc(c2n1)c1ccc(OC)cc1 |
Title of publication | Solvates of a dianisyl-substituted donor–acceptor-type benzothiadiazole: mechanochromic, vapochromic, and acid-responsive multicolor luminescence |
Authors of publication | Yagi, Takumi; Tachikawa, Takashi; Ito, Suguru |
Journal of publication | CrystEngComm |
Year of publication | 2023 |
Journal volume | 25 |
Journal issue | 16 |
Pages of publication | 2379 - 2389 |
a | 13.2848 ± 0.0002 Å |
b | 21.9654 ± 0.0003 Å |
c | 10.92692 ± 0.00017 Å |
α | 90° |
β | 111.87 ± 0.0018° |
γ | 90° |
Cell volume | 2959.06 ± 0.08 Å3 |
Cell temperature | 223 K |
Ambient diffraction temperature | 223 K |
Number of distinct elements | 5 |
Space group number | 14 |
Hermann-Mauguin space group symbol | P 1 21/c 1 |
Hall space group symbol | -P 2ybc |
Residual factor for all reflections | 0.0458 |
Residual factor for significantly intense reflections | 0.0425 |
Weighted residual factors for significantly intense reflections | 0.1081 |
Weighted residual factors for all reflections included in the refinement | 0.1106 |
Goodness-of-fit parameter for all reflections included in the refinement | 1.057 |
Diffraction radiation wavelength | 1.54184 Å |
Diffraction radiation type | CuKα |