Information card for entry 7246491
Chemical name | 4-(4-methoxyphenyl)-7-[1-(4-methoxyphenyl)-1H-phenanthro[9,10-d]imidazol-2-yl]benzo[c][1,2,5]thiadiazole |
Formula | C35 H24 N4 O2 S |
Calculated formula | C35 H24 N4 O2 S |
Title of publication | Solvates of a dianisyl-substituted donor–acceptor-type benzothiadiazole: mechanochromic, vapochromic, and acid-responsive multicolor luminescence |
Authors of publication | Yagi, Takumi; Tachikawa, Takashi; Ito, Suguru |
Journal of publication | CrystEngComm |
Year of publication | 2023 |
Journal volume | 25 |
Journal issue | 16 |
Pages of publication | 2379 - 2389 |
a | 12.20306 ± 0.00009 Å |
b | 21.16656 ± 0.00017 Å |
c | 22.98109 ± 0.00018 Å |
α | 69.0121 ± 0.0007° |
β | 87.5755 ± 0.0006° |
γ | 87.6112 ± 0.0006° |
Cell volume | 5534.93 ± 0.08 Å3 |
Cell temperature | 223 K |
Ambient diffraction temperature | 223 K |
Number of distinct elements | 5 |
Space group number | 2 |
Hermann-Mauguin space group symbol | P -1 |
Hall space group symbol | -P 1 |
Residual factor for all reflections | 0.067 |
Residual factor for significantly intense reflections | 0.0608 |
Weighted residual factors for significantly intense reflections | 0.1731 |
Weighted residual factors for all reflections included in the refinement | 0.1783 |
Goodness-of-fit parameter for all reflections included in the refinement | 1.037 |
Diffraction radiation wavelength | 1.54184 Å |
Diffraction radiation type | CuKα |