Information card for entry 7246498
Formula | C19 H25 N3 O |
Calculated formula | C19 H25 N3 O |
Title of publication | Tuning anticancer properties and DNA-binding of Pt(ii) complexes via alteration of nitrogen softness/basicity of tridentate ligands |
Authors of publication | Al-Rashdi, Kamelah S.; Babgi, Bandar A.; Ali, Ehab M. M.; Jedidi, Abdesslem; Emwas, Abdul-Hamid M.; Davaasuren, Bambar; Jaremko, Mariusz; Humphrey, Mark G. |
Journal of publication | RSC Advances |
Year of publication | 2023 |
Journal volume | 13 |
Journal issue | 14 |
Pages of publication | 9333 - 9346 |
a | 10.7397 ± 0.0008 Å |
b | 10.9415 ± 0.0009 Å |
c | 16.0325 ± 0.0012 Å |
α | 88.444 ± 0.003° |
β | 72.754 ± 0.003° |
γ | 70.469 ± 0.003° |
Cell volume | 1690.3 ± 0.2 Å3 |
Cell temperature | 120 ± 2 K |
Ambient diffraction temperature | 120.01 K |
Number of distinct elements | 4 |
Space group number | 2 |
Hermann-Mauguin space group symbol | P -1 |
Hall space group symbol | -P 1 |
Residual factor for all reflections | 0.0625 |
Residual factor for significantly intense reflections | 0.0465 |
Weighted residual factors for significantly intense reflections | 0.1163 |
Weighted residual factors for all reflections included in the refinement | 0.1318 |
Goodness-of-fit parameter for all reflections included in the refinement | 1.046 |
Diffraction radiation probe | x-ray |
Diffraction radiation wavelength | 0.71073 Å |
Diffraction radiation type | MoKα |