Information card for entry 7246503
Formula | C30 H26 Co N4 O2 |
Calculated formula | C30 H26 Co N4 O2 |
Title of publication | Theoretical and solid-state structures of three new macroacyclic Schiff base complexes and the investigation of their anticancer, antioxidant and antibacterial properties |
Authors of publication | Rezaei, Mohammad Taher; Keypour, Hassan; Hajari, Saadat; yaghoobi, Fereshteh; Moazzami Farida, Seyed Hamed; Saadati, Masoud; Gable, Robert William |
Journal of publication | RSC Advances |
Year of publication | 2023 |
Journal volume | 13 |
Journal issue | 14 |
Pages of publication | 9418 - 9427 |
a | 19.669 ± 0.004 Å |
b | 7.357 ± 0.0015 Å |
c | 17.509 ± 0.004 Å |
α | 90° |
β | 104.87 ± 0.03° |
γ | 90° |
Cell volume | 2448.8 ± 1 Å3 |
Cell temperature | 100 ± 0.2 K |
Ambient diffraction temperature | 100 ± 0.2 K |
Number of distinct elements | 5 |
Space group number | 15 |
Hermann-Mauguin space group symbol | C 1 2/c 1 |
Hall space group symbol | -C 2yc |
Residual factor for all reflections | 0.0321 |
Residual factor for significantly intense reflections | 0.0315 |
Weighted residual factors for significantly intense reflections | 0.0961 |
Weighted residual factors for all reflections included in the refinement | 0.0966 |
Goodness-of-fit parameter for all reflections included in the refinement | 1.156 |
Diffraction radiation wavelength | 0.71087 Å |
Diffraction radiation type | Synchrotron |