Information card for entry 7246506
Formula | C22 H19 F N2 O |
Calculated formula | C22 H19 F N2 O |
Title of publication | Polar and non-polar stacking of perfectly aligned parallel beloamphiphile monolayers (PBAMs) of (PhO, F)-azine. The interplay of non-covalent interlayer interactions and unit cell polarity |
Authors of publication | Bhoday, Harmeet; Kelley, Steven P.; Glaser, Rainer |
Journal of publication | CrystEngComm |
Year of publication | 2023 |
Journal volume | 25 |
Journal issue | 15 |
Pages of publication | 2175 - 2180 |
a | 6.5322 ± 0.0015 Å |
b | 7.3486 ± 0.0017 Å |
c | 37.987 ± 0.009 Å |
α | 91.159 ± 0.003° |
β | 93.956 ± 0.003° |
γ | 90.147 ± 0.004° |
Cell volume | 1818.7 ± 0.7 Å3 |
Cell temperature | 293 ± 2 K |
Ambient diffraction temperature | 293 ± 2 K |
Number of distinct elements | 5 |
Space group number | 2 |
Hermann-Mauguin space group symbol | P -1 |
Hall space group symbol | -P 1 |
Residual factor for all reflections | 0.1554 |
Residual factor for significantly intense reflections | 0.0699 |
Weighted residual factors for significantly intense reflections | 0.1589 |
Weighted residual factors for all reflections included in the refinement | 0.1995 |
Goodness-of-fit parameter for all reflections included in the refinement | 0.92 |
Diffraction radiation wavelength | 0.71073 Å |
Diffraction radiation type | MoKα |