Information card for entry 7246509
Formula | C26 H21.06 N4 Ni0.5 O3 |
Calculated formula | C26 H21 N4 Ni0.5 O3 |
Title of publication | Square-planar and octahedral nickel complexes of an acylhydrazone ligand and the serendipitous isolation of a potential octahedral nickel acylhydrazone precursor |
Authors of publication | Carballo, Rosa; Lago, Ana Belén; Vázquez-Toirán, María; Estévez, Laura; Vázquez-López, Ezequiel M. |
Journal of publication | CrystEngComm |
Year of publication | 2023 |
Journal volume | 25 |
Journal issue | 16 |
Pages of publication | 2463 - 2472 |
a | 34.338 ± 0.002 Å |
b | 34.338 ± 0.002 Å |
c | 12.6009 ± 0.0011 Å |
α | 90° |
β | 90° |
γ | 120° |
Cell volume | 12867.1 ± 1.5 Å3 |
Cell temperature | 173 ± 2 K |
Ambient diffraction temperature | 173 ± 2 K |
Number of distinct elements | 5 |
Space group number | 148 |
Hermann-Mauguin space group symbol | R -3 :H |
Hall space group symbol | -R 3 |
Residual factor for all reflections | 0.0945 |
Residual factor for significantly intense reflections | 0.067 |
Weighted residual factors for significantly intense reflections | 0.1924 |
Weighted residual factors for all reflections included in the refinement | 0.2197 |
Goodness-of-fit parameter for all reflections included in the refinement | 1.056 |
Diffraction radiation wavelength | 1.54184 Å |
Diffraction radiation type | CuKα |