Information card for entry 7246513
Formula | C79 H85 Eu2 N5 O25 |
Calculated formula | C79 H85 Eu2 N5 O25 |
Title of publication | (Z)-4,4′-Stilbene dicarboxylic acid, the overlooked metal–organic framework linker |
Authors of publication | Hunter, Lucy R.; Karlsson, Joshua K. G.; Sellars, Jonathan D.; Probert, Michael R. |
Journal of publication | CrystEngComm |
Year of publication | 2023 |
Journal volume | 25 |
Journal issue | 16 |
Pages of publication | 2353 - 2358 |
a | 9.6431 ± 0.0001 Å |
b | 11.6693 ± 0.0001 Å |
c | 34.9873 ± 0.0004 Å |
α | 91.212 ± 0.001° |
β | 93.949 ± 0.001° |
γ | 93.586 ± 0.001° |
Cell volume | 3918.74 ± 0.07 Å3 |
Cell temperature | 149.99 ± 0.1 K |
Ambient diffraction temperature | 149.99 ± 0.1 K |
Number of distinct elements | 5 |
Space group number | 2 |
Hermann-Mauguin space group symbol | P -1 |
Hall space group symbol | -P 1 |
Residual factor for all reflections | 0.0479 |
Residual factor for significantly intense reflections | 0.032 |
Weighted residual factors for significantly intense reflections | 0.0666 |
Weighted residual factors for all reflections included in the refinement | 0.0717 |
Goodness-of-fit parameter for all reflections included in the refinement | 1.03 |
Diffraction radiation probe | x-ray |
Diffraction radiation wavelength | 0.71073 Å |
Diffraction radiation type | MoKα |