Information card for entry 7246530
Formula | C19 H20 Eu2 N2 O16 |
Calculated formula | C19 H20 Eu2 N2 O16 |
Title of publication | Selective and efficient detection of Pb2+ in aqueous solution by lanthanoid-organic frameworks bearing pyridine-3,4-dicarboxylic acid and glutaric acid |
Authors of publication | ul Nisa, Zaib; Ashashi, Nargis Akhter; Singhaal, Richa; Ahmad, Musheer; Gomila, Rosa M.; Frontera, Antonio; Sheikh, Haq Nawaz |
Journal of publication | CrystEngComm |
Year of publication | 2023 |
Journal volume | 25 |
Journal issue | 16 |
Pages of publication | 2418 - 2440 |
a | 5.9862 ± 0.0001 Å |
b | 26.6117 ± 0.0003 Å |
c | 11.3914 ± 0.0002 Å |
α | 90° |
β | 101.668 ± 0.001° |
γ | 90° |
Cell volume | 1777.18 ± 0.05 Å3 |
Cell temperature | 296 ± 2 K |
Ambient diffraction temperature | 296 ± 2 K |
Number of distinct elements | 5 |
Space group number | 11 |
Hermann-Mauguin space group symbol | P 1 21/m 1 |
Hall space group symbol | -P 2yb |
Residual factor for all reflections | 0.0542 |
Residual factor for significantly intense reflections | 0.0525 |
Weighted residual factors for significantly intense reflections | 0.1587 |
Weighted residual factors for all reflections included in the refinement | 0.1596 |
Goodness-of-fit parameter for all reflections included in the refinement | 1.235 |
Diffraction radiation wavelength | 0.71073 Å |
Diffraction radiation type | MoKα |