Information card for entry 7246533
Formula | C19 H20 N2 O16 Tb2 |
Calculated formula | C19 H20 N2 O16 Tb2 |
Title of publication | Selective and efficient detection of Pb2+ in aqueous solution by lanthanoid-organic frameworks bearing pyridine-3,4-dicarboxylic acid and glutaric acid |
Authors of publication | ul Nisa, Zaib; Ashashi, Nargis Akhter; Singhaal, Richa; Ahmad, Musheer; Gomila, Rosa M.; Frontera, Antonio; Sheikh, Haq Nawaz |
Journal of publication | CrystEngComm |
Year of publication | 2023 |
Journal volume | 25 |
Journal issue | 16 |
Pages of publication | 2418 - 2440 |
a | 5.9578 ± 0.0001 Å |
b | 26.4881 ± 0.0005 Å |
c | 11.3463 ± 0.0002 Å |
α | 90° |
β | 101.548 ± 0.002° |
γ | 90° |
Cell volume | 1754.32 ± 0.06 Å3 |
Cell temperature | 298 ± 2 K |
Ambient diffraction temperature | 298 ± 2 K |
Number of distinct elements | 5 |
Space group number | 11 |
Hermann-Mauguin space group symbol | P 1 21/m 1 |
Hall space group symbol | -P 2yb |
Residual factor for all reflections | 0.0817 |
Residual factor for significantly intense reflections | 0.0776 |
Weighted residual factors for significantly intense reflections | 0.1947 |
Weighted residual factors for all reflections included in the refinement | 0.1966 |
Goodness-of-fit parameter for all reflections included in the refinement | 1.274 |
Diffraction radiation wavelength | 0.71073 Å |
Diffraction radiation type | MoKα |