Information card for entry 7246559
Formula | C70 H54 Eu F12 N O9 |
Calculated formula | C70 H54 Eu F12 N O9 |
Title of publication | Coordination-driven self-assembly of a sandwich shaped Eu(iii) complex for induced circularly polarized luminescence |
Authors of publication | Yin, Sen; Li, Xiaomeng; Wang, Hongjing; Li, Jingya; Huang, Wenru; Gao, Ting; Yan, Pengfei; Zhou, Yanyan; Li, Hongfeng |
Journal of publication | CrystEngComm |
Year of publication | 2023 |
Journal volume | 25 |
Journal issue | 10 |
Pages of publication | 1541 - 1549 |
a | 14.7676 ± 0.0003 Å |
b | 19.8952 ± 0.0005 Å |
c | 23.4556 ± 0.0005 Å |
α | 65.078 ± 0.001° |
β | 80.373 ± 0.001° |
γ | 86.046 ± 0.001° |
Cell volume | 6161.6 ± 0.2 Å3 |
Cell temperature | 193 K |
Ambient diffraction temperature | 193 K |
Number of distinct elements | 6 |
Space group number | 2 |
Hermann-Mauguin space group symbol | P -1 |
Hall space group symbol | -P 1 |
Residual factor for all reflections | 0.0846 |
Residual factor for significantly intense reflections | 0.049 |
Weighted residual factors for significantly intense reflections | 0.0944 |
Weighted residual factors for all reflections included in the refinement | 0.1103 |
Goodness-of-fit parameter for all reflections included in the refinement | 1.015 |
Diffraction radiation probe | x-ray |
Diffraction radiation wavelength | 0.71073 Å |
Diffraction radiation type | MoKα |