Information card for entry 7246571
Formula | C15 H15 N6 P S |
Calculated formula | C15 H15 N6 P S |
SMILES | S=P(Nc1cnccc1)(Nc1cnccc1)Nc1cnccc1 |
Title of publication | Competing and directing interactions in new phosphoramide/thiophosphoramide structures: energy considerations and evidence for CH⋯HC contacts and aliphatic–aromatic stacking |
Authors of publication | Hosseinpoor, Saeed; Pourayoubi, Mehrdad; Abrishami, Mozhgan; Sobati, Marjan; Karimi Ahmadabad, Fatemeh; Sabbaghi, Fahimeh; Nečas, Marek; Dušek, Michal; Kučeráková, Monika; Kaur, Manpreet |
Journal of publication | CrystEngComm |
Year of publication | 2023 |
Journal volume | 25 |
Journal issue | 17 |
Pages of publication | 2557 - 2569 |
a | 9.4456 ± 0.0002 Å |
b | 12.1063 ± 0.0002 Å |
c | 14.6424 ± 0.0003 Å |
α | 90° |
β | 90° |
γ | 90° |
Cell volume | 1674.38 ± 0.06 Å3 |
Cell temperature | 120 ± 2 K |
Ambient diffraction temperature | 120 ± 2 K |
Number of distinct elements | 5 |
Space group number | 33 |
Hermann-Mauguin space group symbol | P n a 21 |
Hall space group symbol | P 2c -2n |
Residual factor for all reflections | 0.0254 |
Residual factor for significantly intense reflections | 0.0246 |
Weighted residual factors for significantly intense reflections | 0.0628 |
Weighted residual factors for all reflections included in the refinement | 0.0636 |
Goodness-of-fit parameter for all reflections included in the refinement | 1.052 |
Diffraction radiation wavelength | 0.71073 Å |
Diffraction radiation type | MoKα |