Information card for entry 7246573
Formula | C20 H32 Cl N2 O2 P |
Calculated formula | C20 H32 Cl N2 O2 P |
SMILES | Clc1ccc(OP(=O)(N(C2CCCCC2)C)N(C)C2CCCCC2)cc1 |
Title of publication | Competing and directing interactions in new phosphoramide/thiophosphoramide structures: energy considerations and evidence for CH⋯HC contacts and aliphatic–aromatic stacking |
Authors of publication | Hosseinpoor, Saeed; Pourayoubi, Mehrdad; Abrishami, Mozhgan; Sobati, Marjan; Karimi Ahmadabad, Fatemeh; Sabbaghi, Fahimeh; Nečas, Marek; Dušek, Michal; Kučeráková, Monika; Kaur, Manpreet |
Journal of publication | CrystEngComm |
Year of publication | 2023 |
Journal volume | 25 |
Journal issue | 17 |
Pages of publication | 2557 - 2569 |
a | 6.0515 ± 0.0002 Å |
b | 17.9235 ± 0.0008 Å |
c | 19.304 ± 0.0008 Å |
α | 90° |
β | 93.157 ± 0.003° |
γ | 90° |
Cell volume | 2090.61 ± 0.14 Å3 |
Cell temperature | 293 K |
Ambient diffraction temperature | 293 K |
Number of distinct elements | 6 |
Space group number | 14 |
Hermann-Mauguin space group symbol | P 1 21/c 1 |
Hall space group symbol | -P 2ybc |
Residual factor for all reflections | 0.062 |
Residual factor for significantly intense reflections | 0.0513 |
Weighted residual factors for significantly intense reflections | 0.0607 |
Weighted residual factors for all reflections included in the refinement | 0.0632 |
Goodness-of-fit parameter for significantly intense reflections | 1.75 |
Goodness-of-fit parameter for all reflections included in the refinement | 1.62 |
Diffraction radiation probe | x-ray |
Diffraction radiation wavelength | 1.54184 Å |
Diffraction radiation type | CuKα |