Information card for entry 7246582
Formula | C60 H72 Cu4 N8 O24 |
Calculated formula | C60 H72 Cu4 N8 O24 |
Title of publication | Design and synthesis of copper(ii) malonates with N,N′-containing linkers |
Authors of publication | Zorina-Tikhonova, Ekaterina N.; Chistyakov, Aleksandr S.; Novikova, Veronika A.; Knyazev, Daniil A.; Gogoleva, Natalia V.; Blinou, Daniil O.; Efimov, Nikolay N.; Dorovatovskii, Pavel V.; Kiskin, Mikhail A.; Eremenko, Igor L.; Vologzhanina, Anna V. |
Journal of publication | CrystEngComm |
Year of publication | 2023 |
Journal volume | 25 |
Journal issue | 19 |
Pages of publication | 2859 - 2870 |
a | 24.8208 ± 0.0014 Å |
b | 19.2806 ± 0.0011 Å |
c | 13.1952 ± 0.0008 Å |
α | 90° |
β | 95.625 ± 0.001° |
γ | 90° |
Cell volume | 6284.3 ± 0.6 Å3 |
Cell temperature | 120 K |
Ambient diffraction temperature | 120 K |
Number of distinct elements | 5 |
Space group number | 14 |
Hermann-Mauguin space group symbol | P 1 21/c 1 |
Hall space group symbol | -P 2ybc |
Residual factor for all reflections | 0.1046 |
Residual factor for significantly intense reflections | 0.0587 |
Weighted residual factors for significantly intense reflections | 0.1471 |
Weighted residual factors for all reflections included in the refinement | 0.1714 |
Goodness-of-fit parameter for all reflections included in the refinement | 1.016 |
Diffraction radiation wavelength | 0.71073 Å |
Diffraction radiation type | MoKα |