Information card for entry 7246617
Formula | C0.86 H1.71 N2.29 O0.57 |
Calculated formula | C0.857143 H1.71429 N2.28571 O0.571429 |
Title of publication | A π-stacking highly stable insensitive energetic inner salt and its insensitive energetic salts |
Authors of publication | Zhang, Jinhao; Jin, Zhiyuan; Xia, Yunlong; Li, Ying; Hao, Wenjia; Guo, Zhicheng; Wang, Ying; Peng, Rufang; Jin, Bo |
Journal of publication | CrystEngComm |
Year of publication | 2023 |
Journal volume | 25 |
Journal issue | 21 |
Pages of publication | 3181 - 3188 |
a | 12.714 ± 0.0016 Å |
b | 8.0602 ± 0.001 Å |
c | 7.0415 ± 0.0008 Å |
α | 90° |
β | 95.899 ± 0.003° |
γ | 90° |
Cell volume | 717.77 ± 0.15 Å3 |
Cell temperature | 296 ± 2 K |
Ambient diffraction temperature | 296 ± 2 K |
Number of distinct elements | 4 |
Space group number | 14 |
Hermann-Mauguin space group symbol | P 1 21/c 1 |
Hall space group symbol | -P 2ybc |
Residual factor for all reflections | 0.0506 |
Residual factor for significantly intense reflections | 0.0376 |
Weighted residual factors for significantly intense reflections | 0.0848 |
Weighted residual factors for all reflections included in the refinement | 0.0913 |
Goodness-of-fit parameter for all reflections included in the refinement | 1.111 |
Diffraction radiation wavelength | 0.71073 Å |
Diffraction radiation type | MoKα |