Information card for entry 7246619
Formula | C27 H31 Cl2 N O2 |
Calculated formula | C27 H31 Cl2 N O2 |
SMILES | c1(cc(ccc1Cl)Cl)O.c1cc(ccn1)/C=C/c1ccc(cc1)OCCCCCCCC |
Title of publication | Hydrogen-bonded liquid crystals formed from 4-alkoxystilbazoles and chlorophenols |
Authors of publication | Johnson, Oliver D.; Wainwright, Stephen G.; Whitwood, Adrian C.; Bruce, Duncan W. |
Journal of publication | CrystEngComm |
Year of publication | 2023 |
Journal volume | 25 |
Journal issue | 18 |
Pages of publication | 2778 - 2788 |
a | 7.7755 ± 0.001 Å |
b | 9.6671 ± 0.0012 Å |
c | 16.403 ± 0.002 Å |
α | 91.184 ± 0.003° |
β | 91.699 ± 0.003° |
γ | 92.084 ± 0.002° |
Cell volume | 1231.3 ± 0.3 Å3 |
Cell temperature | 110.15 K |
Ambient diffraction temperature | 110.15 K |
Number of distinct elements | 5 |
Space group number | 2 |
Hermann-Mauguin space group symbol | P -1 |
Hall space group symbol | -P 1 |
Residual factor for all reflections | 0.0523 |
Residual factor for significantly intense reflections | 0.0409 |
Weighted residual factors for significantly intense reflections | 0.1043 |
Weighted residual factors for all reflections included in the refinement | 0.1127 |
Goodness-of-fit parameter for all reflections included in the refinement | 1.034 |
Diffraction radiation wavelength | 0.71073 Å |
Diffraction radiation type | MoKα |