Information card for entry 7246633
Formula | C44 H36 N8 O16 Zn2 |
Calculated formula | C44 H36 N8 O16 Zn2 |
Title of publication | Pyridine-driven assembly of Zn(ii) and Cd(ii) complexes with 2-furoic acid. The role of water in a structural transformation |
Authors of publication | Ejarque, Daniel; Sánchez-Férez, Francisco; Félez-Guerrero, Núria; Calvet, Teresa; Font-Bardia, Mercè; Pons, Josefina |
Journal of publication | CrystEngComm |
Year of publication | 2023 |
Journal volume | 25 |
Journal issue | 18 |
Pages of publication | 2739 - 2754 |
a | 11.0553 ± 0.0007 Å |
b | 13.6054 ± 0.001 Å |
c | 15.7426 ± 0.001 Å |
α | 90° |
β | 104.307 ± 0.002° |
γ | 90° |
Cell volume | 2294.4 ± 0.3 Å3 |
Cell temperature | 100 ± 2 K |
Ambient diffraction temperature | 100 ± 2 K |
Number of distinct elements | 5 |
Space group number | 14 |
Hermann-Mauguin space group symbol | P 1 21/c 1 |
Hall space group symbol | -P 2ybc |
Residual factor for all reflections | 0.0863 |
Residual factor for significantly intense reflections | 0.0628 |
Weighted residual factors for significantly intense reflections | 0.1158 |
Weighted residual factors for all reflections included in the refinement | 0.1243 |
Goodness-of-fit parameter for all reflections included in the refinement | 1.088 |
Diffraction radiation wavelength | 0.71073 Å |
Diffraction radiation type | MoKα |