Information card for entry 7246635
Formula | C27 H25 Cd2 N O16 |
Calculated formula | C27 H25 Cd2 N O16 |
Title of publication | Pyridine-driven assembly of Zn(ii) and Cd(ii) complexes with 2-furoic acid. The role of water in a structural transformation |
Authors of publication | Ejarque, Daniel; Sánchez-Férez, Francisco; Félez-Guerrero, Núria; Calvet, Teresa; Font-Bardia, Mercè; Pons, Josefina |
Journal of publication | CrystEngComm |
Year of publication | 2023 |
Journal volume | 25 |
Journal issue | 18 |
Pages of publication | 2739 - 2754 |
a | 12.3981 ± 0.0006 Å |
b | 8.4459 ± 0.0003 Å |
c | 15.1806 ± 0.0007 Å |
α | 90° |
β | 104.276 ± 0.002° |
γ | 90° |
Cell volume | 1540.52 ± 0.12 Å3 |
Cell temperature | 100 ± 2 K |
Ambient diffraction temperature | 100 ± 2 K |
Number of distinct elements | 5 |
Space group number | 4 |
Hermann-Mauguin space group symbol | P 1 21 1 |
Hall space group symbol | P 2yb |
Residual factor for all reflections | 0.0292 |
Residual factor for significantly intense reflections | 0.0272 |
Weighted residual factors for significantly intense reflections | 0.0645 |
Weighted residual factors for all reflections included in the refinement | 0.0658 |
Goodness-of-fit parameter for all reflections included in the refinement | 1.037 |
Diffraction radiation wavelength | 0.71073 Å |
Diffraction radiation type | MoKα |