Information card for entry 7246645
Formula | C25 H20 N2 O2 |
Calculated formula | C25 H20 N2 O2 |
SMILES | O(Cc1ccccc1)C(=O)C(c1c2c([nH]c1)cccc2)c1c2c([nH]c1)cccc2 |
Title of publication | Uranyl nitrate as a recyclable homogeneous photocatalyst for selective cross-coupling of N-substituted amines and indoles |
Authors of publication | Lv, Shuaipeng; Li, Qiannan; Sang, Ji-Wei; Zhang, Yu; Wang, Jinxin; Zhang, Wei-Dong |
Journal of publication | RSC Advances |
Year of publication | 2023 |
Journal volume | 13 |
Journal issue | 18 |
Pages of publication | 11929 - 11937 |
a | 14.6228 ± 0.0003 Å |
b | 12.8248 ± 0.0003 Å |
c | 20.8582 ± 0.0005 Å |
α | 90° |
β | 90° |
γ | 90° |
Cell volume | 3911.63 ± 0.15 Å3 |
Cell temperature | 273 ± 2 K |
Ambient diffraction temperature | 273 ± 2 K |
Number of distinct elements | 4 |
Space group number | 61 |
Hermann-Mauguin space group symbol | P b c a |
Hall space group symbol | -P 2ac 2ab |
Residual factor for all reflections | 0.0833 |
Residual factor for significantly intense reflections | 0.0554 |
Weighted residual factors for significantly intense reflections | 0.1294 |
Weighted residual factors for all reflections included in the refinement | 0.1499 |
Goodness-of-fit parameter for all reflections included in the refinement | 1.015 |
Diffraction radiation wavelength | 1.54178 Å |
Diffraction radiation type | cukα |