Information card for entry 7246648
Chemical name | Famciclovir-fumaric acid (2:2) Form II |
Formula | C36 H46 N10 O16 |
Calculated formula | C36 H46 N10 O16 |
Title of publication | Famciclovir–fumaric acid: an all-in-one multicomponent system with salt, cocrystal and salt–cocrystal continuum |
Authors of publication | Kotte, Lohith; Pendota, Vinusha; Sreedhar, Bojja; Nanubolu, Jagadeesh Babu |
Journal of publication | CrystEngComm |
Year of publication | 2023 |
Journal volume | 25 |
Journal issue | 17 |
Pages of publication | 2662 - 2678 |
a | 14.095 ± 0.008 Å |
b | 7.424 ± 0.003 Å |
c | 39.15 ± 0.02 Å |
α | 90° |
β | 91.267 ± 0.013° |
γ | 90° |
Cell volume | 4096 ± 4 Å3 |
Cell temperature | 100 ± 2 K |
Ambient diffraction temperature | 100 ± 2 K |
Number of distinct elements | 4 |
Space group number | 14 |
Hermann-Mauguin space group symbol | P 1 21/n 1 |
Hall space group symbol | -P 2yn |
Residual factor for all reflections | 0.0829 |
Residual factor for significantly intense reflections | 0.0475 |
Weighted residual factors for significantly intense reflections | 0.1056 |
Weighted residual factors for all reflections included in the refinement | 0.1231 |
Goodness-of-fit parameter for all reflections included in the refinement | 1.012 |
Diffraction radiation wavelength | 0.71073 Å |
Diffraction radiation type | MoKα |