Information card for entry 7246664
Formula | C7 H4 N2 O S4 |
Calculated formula | C7 H4 N2 O S4 |
SMILES | O=C1Sc2c(S1)sc(n2)SCCC#N |
Title of publication | Non-covalent interactions in neutral and oxidized tetrathiafulvalenes |
Authors of publication | Kharraz, Haia; Hachem, Hadi; Le Gal, Yann; Roisnel, Thierry; Jeannin, Olivier; Barrière, Frédéric; Guizouarn, Thierry; Lorcy, Dominique |
Journal of publication | CrystEngComm |
Year of publication | 2023 |
Journal volume | 25 |
Journal issue | 19 |
Pages of publication | 2946 - 2958 |
a | 7.0683 ± 0.0015 Å |
b | 8.6879 ± 0.0017 Å |
c | 9.462 ± 0.002 Å |
α | 111.186 ± 0.008° |
β | 108.771 ± 0.008° |
γ | 97.407 ± 0.008° |
Cell volume | 492.78 ± 0.18 Å3 |
Cell temperature | 150 ± 2 K |
Ambient diffraction temperature | 150 ± 2 K |
Number of distinct elements | 5 |
Space group number | 2 |
Hermann-Mauguin space group symbol | P -1 |
Hall space group symbol | -P 1 |
Residual factor for all reflections | 0.0287 |
Residual factor for significantly intense reflections | 0.0274 |
Weighted residual factors for significantly intense reflections | 0.0766 |
Weighted residual factors for all reflections included in the refinement | 0.0787 |
Goodness-of-fit parameter for all reflections included in the refinement | 1.029 |
Diffraction radiation probe | x-ray |
Diffraction radiation wavelength | 0.71073 Å |
Diffraction radiation type | MoKα |