Information card for entry 7246671
Formula | C10 H6 N2 S8 |
Calculated formula | C10 H6 N2 S8 |
SMILES | S(C)C1=C(SC)SC(S1)=C1Sc2c(S1)sc(SC#N)n2 |
Title of publication | Non-covalent interactions in neutral and oxidized tetrathiafulvalenes |
Authors of publication | Kharraz, Haia; Hachem, Hadi; Le Gal, Yann; Roisnel, Thierry; Jeannin, Olivier; Barrière, Frédéric; Guizouarn, Thierry; Lorcy, Dominique |
Journal of publication | CrystEngComm |
Year of publication | 2023 |
Journal volume | 25 |
Journal issue | 19 |
Pages of publication | 2946 - 2958 |
a | 7.4506 ± 0.0012 Å |
b | 8.1175 ± 0.0012 Å |
c | 13.345 ± 0.002 Å |
α | 73.335 ± 0.005° |
β | 87.672 ± 0.006° |
γ | 81.049 ± 0.006° |
Cell volume | 763.8 ± 0.2 Å3 |
Cell temperature | 150 ± 2 K |
Ambient diffraction temperature | 150 ± 2 K |
Number of distinct elements | 4 |
Space group number | 2 |
Hermann-Mauguin space group symbol | P -1 |
Hall space group symbol | -P 1 |
Residual factor for all reflections | 0.0291 |
Residual factor for significantly intense reflections | 0.0274 |
Weighted residual factors for significantly intense reflections | 0.0785 |
Weighted residual factors for all reflections included in the refinement | 0.0806 |
Goodness-of-fit parameter for all reflections included in the refinement | 1.039 |
Diffraction radiation probe | x-ray |
Diffraction radiation wavelength | 0.71073 Å |
Diffraction radiation type | MoKα |