Information card for entry 7246684
Chemical name | 4-fluoro-6-nitrobenzene-1,3-diamine 18-crown-6 1:1 cocrystal |
Formula | C18 H30 F N3 O8 |
Calculated formula | C18 H30 F N3 O8 |
SMILES | Fc1c(N)cc(N)c(N(=O)=O)c1.O1CCOCCOCCOCCOCCOCC1 |
Title of publication | How does the combination of the nitro group and fluorine atoms affect the (co)crystallization behaviour of arylenediamines? |
Authors of publication | Vaganova, Tamara A.; Gatilov, Yurij V.; Kryuchkova, Natalia A.; Pishchur, Denis P.; Zhukovets, Anastasia A.; Malykhin, Evgenij V. |
Journal of publication | CrystEngComm |
Year of publication | 2023 |
Journal volume | 25 |
Journal issue | 22 |
Pages of publication | 3284 - 3298 |
a | 14.0576 ± 0.0005 Å |
b | 11.0469 ± 0.0003 Å |
c | 15.0431 ± 0.0006 Å |
α | 90° |
β | 111.343 ± 0.002° |
γ | 90° |
Cell volume | 2175.87 ± 0.13 Å3 |
Cell temperature | 296 ± 2 K |
Ambient diffraction temperature | 296 ± 2 K |
Number of distinct elements | 5 |
Space group number | 9 |
Hermann-Mauguin space group symbol | C 1 c 1 |
Hall space group symbol | C -2yc |
Residual factor for all reflections | 0.0472 |
Residual factor for significantly intense reflections | 0.0346 |
Weighted residual factors for significantly intense reflections | 0.08 |
Weighted residual factors for all reflections included in the refinement | 0.0874 |
Goodness-of-fit parameter for all reflections included in the refinement | 1.013 |
Diffraction radiation wavelength | 0.71073 Å |
Diffraction radiation type | MoKα |